Türkiye'nin ilk Cross-Platform OldSchool MOBİL & PC 1-99 Sunucusu Lamira2 6 Kasım'da Açılıyor! Büyük Açılışı Kaçırma HEMEN TIKLA!
input_db.cpp: In member function 'void CInputDB:layerCreateSuccess(DESC*, const char*)':
input_db.cpp:326: error: expected `}' before 'unsigned'
input_db.cpp:326: error: expected `}' before 'unsigned'
input_db.cpp:326: error: expected `}' before 'unsigned'
input_db.cpp:326: error: expected `}' before 'unsigned'
input_db.cpp:326: error: braces around scalar initializer for type 'BYTE'
input_db.cpp:326: error: braces around scalar initializer for type 'WORD'
input_db.cpp:326: error: braces around scalar initializer for type 'DWORD'
input_db.cpp:326: error: braces around scalar initializer for type 'DWORD'
input_db.cpp:326: error: braces around scalar initializer for type 'long int'
input_db.cpp:326: error: braces around scalar initializer for type 'long int'
input_db.cpp:326: error: braces around scalar initializer for type 'long int'
input_db.cpp:326: error: braces around scalar initializer for type 'long int'
input_db.cpp:326: error: braces around scalar initializer for type 'long int'
input_db.cpp:326: error: braces around scalar initializer for type 'long int'
input_db.cpp:326: error: too many initializers for 'CInputDB:layerCreateSuccess(DESC*, const char*)::SInitialItem'
input_db.cpp:326: error: expected ',' or ';' before 'unsigned'
input_db.cpp:328: error: 'job' was not declared in this scope
compiling locale.cpp
compiling locale_service.cpp
gmake: *** [.obj/input_db.o] Error 1
gmake: *** Waiting for unfinished jobs....
layerCreateSuccess(DESC*, const char*)':