Merhaba arkadaşlar db build alırken böyle bir hata alıyorum çözemedim yardımcı olursanız sevinirim
Kod:
In file included from DBManager.cppIn file included from :ClientManager.cppNetBase.cpp3In file included from :::
Main.cpp4:In file included from 4:5./ClientManager.h:
10:
:In file included from :In file included from 18./ClientManager.h ./ClientManager.h:
::In file included from 1818../../../Extern/include/rapidjson/document.hCache.cpp:
fatal error: :
::../../../Extern/include/rapidjson/document.h:326:82: error: cannot assign to non-static data member 'length' with const-qualified type 'const SizeType' (aka 'const unsigned int')
326 | GenericStringRef& operator=(const GenericStringRef& rhs) { s = rhs.s; length = rhs.length; }
| ~~~~~~ ^
../../../Extern/include/rapidjson/document.h:332:20: note: non-static data member 'length' declared const here
332 | const SizeType length; //!< length of the string (excluding the trailing NULL terminator)
| ~~~~~~~~~~~~~~~^~~~~~
'../../common/billing.h' file not found
4 | #include "../../common/billing.h"
| ^~~~~~~~~~~~~~~~~~~~~~~~
In file included from 3265../../../Extern/include/rapidjson/document.h::
LoginData.cpp:82: error: cannot assign to non-static data member 'length' with const-qualified type 'const SizeType' (aka 'const unsigned int')
326 | GenericStringRef& operator=(const GenericStringRef& rhs) { s = rhs.s; length = rhs.length; }
| ~~~~~~ ^
../../../Extern/include/rapidjson/document.h:332:20: note: non-static data member 'length' declared const here
332 | const SizeType length; //!< length of the string (excluding the trailing NULL terminator)
| ~~~~~~~~~~~~~~~^~~~~~
In file included from :326:./ClientManager.h382::
:18In file included from ./ClientManager.h:
error: cannot assign to non-static data member 'length' with const-qualified type 'const SizeType' (aka 'const unsigned int')
326 | GenericStringRef& operator=(const GenericStringRef& rhs) { s = rhs.s; length = rhs.length; }
| ~~~~~~ ^
../../../Extern/include/rapidjson/document.h:332:20: note: non-static data member 'length' declared const here
332 | const SizeType length; //!< length of the string (excluding the trailing NULL terminator)
| ~~~~~~~~~~~~~~~^~~~~~
:18../../../Extern/include/rapidjson/document.h:
:In file included from 326ClientManagerLogin.cpp../../../Extern/include/rapidjson/document.h:::824326::
: 82In file included from In file included from DBManager.cpp:3:
./ClientManager.h:365:2: error: no template named 'unordered_set' in namespace 'std'; did you mean 'boost::unordered_set'?
365 | std::unordered_set<CPeer*> m_setAuthPeer; // @fixme333 ptr to list of ptr
| ^~~~~~~~~~~~~~~~~~
| boost::unordered_set
/usr/local/include/boost/unordered/unordered_set_fwd.hpp:79:27: note: 'boost::unordered_set' declared here
79 | using boost::unordered::unordered_set;
| ^
In file included from :1./ClientManager.h NetBase.cpp error:error: :18 generatedIn file included from 4:
.
ClientManagerPlayer.cppIn file included from gmake: *** [Makefile:110: .obj/ClientManager.o] Error 1
gmake: *** Waiting for unfinished jobs....
error: :
:In file included from cannot assign to non-static data member 'length' with const-qualified type 'const SizeType' (aka 'const unsigned int')../../../Extern/include/rapidjson/document.hMain.cpp3ClientManagerBoot.cpp./ClientManager.h:
cannot assign to non-static data member 'length' with const-qualified type 'const SizeType' (aka 'const unsigned int'):
:::365:2: error: no template named 'unordered_set' in namespace 'std'; did you mean 'boost::unordered_set'?
365 | std::unordered_set<CPeer*> m_setAuthPeer; // @fixme333 ptr to list of ptr
| ^~~~~~~~~~~~~~~~~~
| boost::unordered_set
/usr/local/include/boost/unordered/unordered_set_fwd.hpp:79:27: note: 'boost::unordered_set' declared here
79 | using boost::unordered::unordered_set;
| ^
326 In file included from 53326
:./ClientManager.h:
:
| 82:In file included from 326:18./ClientManager.h:365:2: error: no template named 'unordered_set' in namespace 'std'; did you mean 'boost::unordered_set'?
365 | std::unordered_set<CPeer*> m_setAuthPeer; // @fixme333 ptr to list of ptr
| ^~~~~~~~~~~~~~~~~~
| boost::unordered_set
/usr/local/include/boost/unordered/unordered_set_fwd.hpp:79:27: note: 'boost::unordered_set' declared here
79 | using boost::unordered::unordered_set;
| ^
./ClientManager.h | :
:In file included from 18../../../Extern/include/rapidjson/document.hClientManagerParty.cppG error: :
::e 3262nG../../../Extern/include/rapidjson/document.h::
eecannot assign to non-static data member 'length' with const-qualified type 'const SizeType' (aka 'const unsigned int'):82In file included from 2rn326:./ClientManager.h errorIn file included from ie
: :sClientManagerGuild.cppcr 8218: generatedSicStringRef& operator=(const GenericStringRef& rhs) { s = rhs.s; length = rhs.length; }
| ~~~~~~ ^
../../../Extern/include/rapidjson/document.h:332:20: note: non-static data member 'length' declared const here
332 | const SizeType length; //!< length of the string (excluding the trailing NULL terminator)
| ~~~~~~~~~~~~~~~^~~~~~
326::
2.
t | gmake: *** [Makefile:110: .obj/DBManager.o] Error 1
r error: :
2 i../../../Extern/include/rapidjson/document.hIn file included from errorn :./ClientManager.hsg cannot assign to non-static data member 'length' with const-qualified type 'const SizeType' (aka 'const unsigned int')error: 326: generatedR :18.
eG
82:
gmake: *** [Makefile:110: .obj/NetBase.o] Error 1
fe cannot assign to non-static data member 'length' with const-qualified type 'const SizeType' (aka 'const unsigned int'):&n326 ../../../Extern/include/rapidjson/document.h e |
:ricStringRef& operator=(const GenericStringRef& rhs) { s = rhs.s; length = rhs.length; }
| ~~~~~~ ^
../../../Extern/include/rapidjson/document.h:332:20: note: non-static data member 'length' declared const here
332 | const SizeType length; //!< length of the string (excluding the trailing NULL terminator)
| ~~~~~~~~~~~~~~~^~~~~~
326In file included from o 326error: :pPrivManager.cpp | 82e ::In file included from rG ator=(const GenericStringRef& rhs) { s = rhs.s; length = rhs.length; }
| ~~~~~~ ^
../../../Extern/include/rapidjson/document.h:332:20: note: non-static data member 'length' declared const here
332 | const SizeType length; //!< length of the string (excluding the trailing NULL terminator)
| ~~~~~~~~~~~~~~~^~~~~~
cannot assign to non-static data member 'length' with const-qualified type 'const SizeType' (aka 'const unsigned int') 3GuildManager.cppe n :
:eGIn file included from
reIn file included from 4 LoginData.cppinerror: ./ClientManager.h:
2In file included from 326ce | ::In file included from errorMoneyLog.cppIn file included from Sr 318./ClientManager.hs:ItemAwardManager.cppti cannot assign to non-static data member 'length' with const-qualified type 'const SizeType' (aka 'const unsigned int'):
:
: generated3:rc 18.
:
6iS
../../../Extern/include/rapidjson/document.h./ClientManager.h:
gmake: *** [Makefile:110: .obj/Main.o] Error 1
In file included from :
ntG ::./ClientManager.hIn file included from gre326326365../../../Extern/include/rapidjson/document.h:./ClientManager.hRin | :::18:ene 822326:
18fgr ::::
&Ref& operator=(const GenericStringRef& rhs) { s = rhs.s; length = rhs.length; }
| ~~~~~~ ^
../../../Extern/include/rapidjson/document.h:332:20: note: non-static data member 'length' declared const here
332 | const SizeType length; //!< length of the string (excluding the trailing NULL terminator)
| ~~~~~~~~~~~~~~~^~~~~~
i 82../../../Extern/include/rapidjson/document.h c ::../../../Extern/include/rapidjson/document.hSGot 326:In file included from eprerror: error: no template named 'unordered_set' in namespace 'std'; did you mean 'boost::unordered_set'?
365 | std::unordered_set<CPeer*> m_setAuthPeer; // @fixme333 ptr to list of ptr
| ^~~~~~~~~~~~~~~~~~
| boost::unordered_set
/usr/local/include/boost/unordered/unordered_set_fwd.hpp:79:27: note: 'boost::unordered_set' declared here
79 | using boost::unordered::unordered_set;
| ^
:326ClientManagerLogin.cppnei82::ernerror: :824ragcannot assign to non-static data member 'length' with const-qualified type 'const SizeType' (aka 'const unsigned int') i::
tRc In file included from In file included from oeS
cannot assign to non-static data member 'length' with const-qualified type 'const SizeType' (aka 'const unsigned int')./ClientManager.hrft error: Cache.cpp:Marriage.cpp&r326
error: :365:= i | (n 326cannot assign to non-static data member 'length' with const-qualified type 'const SizeType' (aka 'const unsigned int')5:5og | cannot assign to non-static data member 'length' with const-qualified type 'const SizeType' (aka 'const unsigned int'):
2:
cpR
oee:
In file included from nrf G 326 ./ClientManager.hs./ClientManager.ha&e | 326:tt :nGo | 36518 rerror: eeo ::
GrnpIn file included from 2e=eie :ClientManagerEventFlag.cpp../../../Extern/include/rapidjson/document.hn(rno template named 'unordered_set' in namespace 'std'; did you mean 'boost::unordered_set'?crG ::eaSieGIn file included from rct
tcne2326ioo rClientManagerBoot.cppSenerror: :
:cnr365itr:eSsIn file included from 82 | nritt=3rr(./ClientManager.h: gicino template named 'unordered_set' in namespace 'std'; did you mean 'boost::unordered_set'?:
In file included from i :sRnScnGcMonarch.cpptgeo218egtS
./ClientManager.hR:dnnees errorfRrt ::error: fr:
5t&eir365:&i fnis365 c :
| u&rSGgn n: generated../../../Extern/include/rapidjson/document.hIn file included from hteo RgsosrnpeR2cannot assign to non-static data member 'length' with const-qualified type 'const SizeType' (aka 'const unsigned int').
:./ClientManager.htr)ieeofe:gmake: *** [Makefile:110: .obj/LoginData.o] Error 1
326dd: nrrp&f:e
{g:18i Rae &:rIn file included from cse82:
S ftr ue326t=&r irrnoaondClientManagerHorseName.cpperror: | hhgss:rtpoo_ R.)es f;{&oeprs lsre hn=sg : =rrede ../../../Extern/include/rapidjson/document.h)tr( hh{ s =.sno template named 'unordered_set' in namespace 'std'; did you mean 'boost::unordered_set'? aret= s r;=h s2:tar<c( lr.ehlnoteCo
Gseg.ntsgh;t 326rodPncIn file included from :
e h=r_esoerror: :;l =setn }
| ~~~~~~ ^
365nerItemIDRangeManager.cpp(=ers../../../Extern/include/rapidjson/document.hIn file included from nh82(t* t:332: | egs20: note: non-static data member 'length' declared const herec<>Gt.:
332 | co: rhl./ClientManager.hocC e n e5sicannot assign to non-static data member 'length' with const-qualified type 'const SizeType' (aka 'const unsigned int') s=nnoPmnGt Stc gizeType lsne_eert::
engtdS
hhtsesrnh;s;treie //!<18In file included from :t . length *tcrl} of t:r326eG >ASihe s:
./ClientManager.hn
error: eG utctriui | g ng (exclnemtrSt| uding nn h:en_hitt; ~~~~~~ ^resPnhe trailinog
g NULL terminatrireeg}../../../Extern/include/rapidjson/document.h18or)
| ~~~~~~~~~~~~~~~^~~~~~rR iciteR
../../../Extern/include/rapidjson/document.hcannot assign to non-static data member 'length' with const-qualified type 'const SizeType' (aka 'const unsigned int')nScAre::
de :gtSu;fefG| 326332Rrtt &r&e
:eirh :../../../Extern/include/rapidjson/document.he ~~~~~~ ^20f n niP/rd82:
:&gne/h e_ Rge s326:326orreRr@)s | ../../../Extern/include/rapidjson/document.hhfe;fpi :e: note: s&f i{332ect) &x 82 :non-static data member 'length' declared const here r /ms20rS<{hr/e :
: satCh 3= 332 | const SizeType length; //!< length of the string (excluding the trailing NULL terminator)
| ~~~~~~~~~~~~~~~^~~~~~
s)s@33 ptr to list of ptr
| ^~~~~~~~~~~~~~~~~~
| boost::unordered_set
/usr/local/include/boost/unordered/unordered_set_fwd.hpp:79:27: note: 'boost::unordered_set' declared here
79 | using boost::unordered::unordered_set;
| ^
trP error: G )freoie={ ihnote: e {xrnnsrrs mgcannot assign to non-static data member 'length' with const-qualified type 'const SizeType' (aka 'const unsigned int')eerror: .non-static data member 'length' declared const here*h se=Rrs>s= 3(;
e
i . =3 f cl332msr 3cannot assign to non-static data member 'length' with const-qualified type 'const SizeType' (aka 'const unsigned int')c&326Se | ;_hr o n sshpn | t
g le.stso r t ets.rtph n i326A;s eIn file included from gu ; nt | =ctlt rClientManagerPlayer.cpp o oh g ehrnl Ga: GR nhsPel=gstet3ee t.enist of ptr
| ^~~~~~~~~~~~~~~~~~
| boost::unordered_set
/usr/local/include/boost/unordered/unordered_set_fwd.hpp:79:27: note: 'boost::unordered_set' declared here
79 | using boost::unordered::unordered_set;
| ^
r:
hl noegnf h eSrters=ni./ClientManager.h;&heGr. gz: rei=lrte365=cehhTin(:/ oSns;y2/rceg. p: hIn file included from ptcSrtl}e2 @she .ClientManagerParty.cppferoti error;n
ll: g eeirinrcs}t| nnherror: x2ansgg
;iS generated ~~~~~~ ^tt m:
tgt
hh| }nt.
;; eoR ~~~~~~ ^
../../../Extern/include/rapidjson/document.hgrgmake: *** [Makefile:110: .obj/ClientManagerLogin.o] Error 1
no template named 'unordered_set' in namespace 'std'; did you mean 'boost::unordered_set'?3}
:/./ClientManager.hre Ri| 332/3:fG
:!en
3 ../../../Extern/include/rapidjson/document.h ~~~~~~ ^20<365=&e| :
: :( n332 l ~~~~~~ ^fg365p:e
2re20../../../Extern/include/rapidjson/document.hn&R | t::chr:note: g r332t../../../Extern/include/rapidjson/document.h:non-static data member 'length' declared const hereh:20 es osi332note: :
ottf: fdon)c20non-static data member 'length' declared const here332 o: :&s S | t :lp
note: h e332non-static data member 'length' declared const here error: t{tuinote: | se
tnon-static data member 'length' declared const here ns cr 332oi
| nn rotro sg si332c t | o (r no template named 'unordered_set' in namespace 'std'; did you mean 'boost::unordered_set'?G n n eap sSx tdoe=gcic ozl neucteef
n RSsTdoityinr erezpnse egtTSorep365rhf yilt pzedt | is&hSeenei Tg zlra_r c. ytteesphrTne;ayg te
iptlsSsrlehe/i ;t tt;hn/nl g!get< n=o<| dr s/h Ng/;lUt! C:il)eLh<nL; /g (rP ^~~~~~~~~~~~~~~~~~:ne l/tte!he/n< r/g e
ugn{om!tlefi<nRg he n ntaloghtc=r oetsefteon h rgt s*| rfh )thothefr
o(>d& =i ostn| fthg re boost::unordered_sete = ~~~~~~~~~~~~~~~^~~~~~
ti (nm
rrrhnse_regtxehhshsc rce/usr/local/include/boost/unordered/unordered_set_fwd.hppsdsstos(ilt:._).ntenuA79:27: note: 'boost::unordered_set' declared here
79 | using boost::unordered::unordered_set;
| ^
ls s srxgdue;e{Gic ittn t enl(nhguegglP<sn dx teeC eG(ictenlhnehP=rexgue;gre inc d t;erceltit}h uhnrrhSrde ga
*stii int=/ >.rctlgr2h /| sii aSer mnti ;nt errorghlth@ ~~~~~~ ^_ gr eirsNsf
slRi naUtg.i generatedeeeniLr lxltLaNnfgem../../../Extern/include/rapidjson/document.h.
i iUAgne:ntlL&Rugmake: *** [Makefile:110: .obj/Cache.o] Error 1
tgg3332eiLt e rn t3:NmgthhhrfUi e320LnNrP;LaUm h& :e tLi toLp e=s ner }tar)trr )rtme;
note: r hoi
r trn m| oh{snon-static data member 'length' declared const here)a| i/ s )tn/ ~~~~~~ ^l
o ~~~~~~~~~~~~~~~^~~~~~.s a
i r
tl {| @s332)oft | e= r ~~~~~~~~~~~~~~~^~~~~~i../../../Extern/include/rapidjson/document.h
n s)
x:o gr | m332f th=
e: hs ~~~~~~~~~~~~~~~^~~~~~| 320p;.rIn file included from
3:tc sh ~~~~~~~~~~~~~~~^~~~~~3 roClientManagerGuild.cpp};s
n .:p
| ^~~~~~~~~~~~~~~~~~
| boost::unordered_set
/usr/local/include/boost/unordered/unordered_set_fwd.hpp:79:27: note: 'boost::unordered_set' declared here
79 | using boost::unordered::unordered_set;
| ^
s
ls2tnote: t e;:
r| n non-static data member 'length' declared const here tgl./ClientManager.hS ~~~~~~ ^o
te:i
hn365zl332 g:ei | ClientManagerPlayer.cpp=t2T../../../Extern/include/rapidjson/document.hst of ptr
| ^~~~~~~~~~~~~~~~~~
| boost::unordered_set
/usr/local/include/boost/unordered/unordered_set_fwd.hpp:79:27: note: 'boost::unordered_set' declared here
79 | using boost::unordered::unordered_set;
| ^
: h:y: 8r p332 :h=e: 10s 20:.rerror: l:c fatal error: 'HB.h' file not found
8 | #include "HB.h"
| ^~~~~~
3 errors generated.
lhgmake: *** [Makefile:110: .obj/ClientManagerPlayer.o] Error 1
e oesnnng.sno template named 'unordered_set' in namespace 'std'; did you mean 'boost::unordered_set'?In file included from tglnote: t
365 | std::unordered_set<CPeer*> m_setAuthPeer; // @fixme333 ptr to list of ptr
| ^~~~~~~~~~~~~~~~~~
| boost::unordered_set
/usr/local/include/boost/unordered/unordered_set_fwd.hpp:79:27: note: 'boost::unordered_set' declared here
79 | using boost::unordered::unordered_set;
| ^
In file included from htePrivManager.cpp2In file included from ; hnnon-static data member 'length' declared const hereGuildManager.cpp: S;gMoneyLog.cpp:3 errori t
:4:
/z}h In file included from s/e;3323:
!T
| ItemAwardManager.cpp:
./ClientManager.h generated<y } :./ClientManager.h p| : .
l6./ClientManager.h:e
365egmake: *** [Makefile:110: .obj/ClientManagerBoot.o] Error 1
:
~~~~~~ ^ :365:nlg
| 365:2etnc./ClientManager.h:2:hg ~~~~~~ ^o:2: tohf../../../Extern/include/rapidjson/document.h
n365: ; : ts: h332/et:../../../Extern/include/rapidjson/document.h2error: / 20::error: !s< :332 error: t Srl :no template named 'unordered_set' in namespace 'std'; did you mean 'boost::unordered_set'?ieinn20zgg no template named 'unordered_set' in namespace 'std'; did you mean 'boost::unordered_set'?:et(note: Terror: no template named 'unordered_set' in namespace 'std'; did you mean 'boost::unordered_set'?
hey2 xnon-static data member 'length' declared const here
poc
fl utdhien errornote: e
365no template named 'unordered_set' in namespace 'std'; did you mean 'boost::unordered_set'? 365gs ttrhiesnon-static data member 'length' declared const herel332 | 365 | n gte |
| r(aeixlcilnu generated
n s sgd i g t365stNnUgL Lt hte.
332t d | tde rt | h : d:mrianialtionrgmake: *** [Makefile:110: .obj/ClientManagerParty.o] Error 1
;:s::g) N
U ctu:u L od| L ~~~~~~~~~~~~~~~^~~~~~t
/n:nunerm/s:onoic!turorno<ndrdan oedetslSrreroteiderernze)ded ger_d_
S tTes_s| ihydesez ~~~~~~~~~~~~~~~^~~~~~p_tete
oes<t<Tf eC<Cy ltPCPpte2<ePeehnCee eg errorePrl terse*eshr* generatede>nt;*>.
In file included from r gr > gmake: *** [Makefile:110: .obj/ClientManagerGuild.o] Error 1
Marriage.cpp*mti m>_hn/m_: s;g/_s5me !se:
_t(<etsA/e tA./ClientManager.heu/xlAutt!ce:utAh<lnthuP 365ughPteldtPeheeih:eePrnn g the ere;go2tr;e tfr; r:ah ;i/ t/ l /oh//i fne/ /@ g @/ftNULL terminator)s@f ih
| ~~~~~~~~~~~~~~~^~~~~~
tfi@xeerror: rixfm ixmiesnmex3tge3m3rno template named 'unordered_set' in namespace 'std'; did you mean 'boost::unordered_set'? 33e3i(333 n
e3 3pg In file included from x p3t 365ClientManagerEventFlag.cppcpt r( | :ltrp e 2ur ttxs:
d trocito lno ttlug loid li sitid./ClientManager.hsltnhsti get so ot::fttof hrf o:365pea pft ipt u:rtltrprirtn2
an
ro ig
:| l |
iN| r ^~~~~~~~~~~~~~~~~~nU ^~~~~~~~~~~~~~~~~~|
gL ^~~~~~~~~~~~~~~~~~
d L
^~~~~~~~~~~~~~~~~~ Ne
| Utr | Leerror: | boost::unordered_setLr boost::unordered_set|
e m boost::unordered_set
tdi
boost::unordered_seteIn file included from _n
/usr/local/include/boost/unordered/unordered_set_fwd.hppno template named 'unordered_set' in namespace 'std'; did you mean 'boost::unordered_set'?ra/usr/local/include/boost/unordered/unordered_set_fwd.hpp:mt/usr/local/include/boost/unordered/unordered_set_fwd.hpp:79iosMonarch.cpp:79/usr/local/include/boost/unordered/unordered_set_fwd.hpp:nr79::27ae:
):2779:t27:: o
: 27tr :)| note: note:
5 < ~~~~~~~~~~~~~~~^~~~~~note: 'boost::unordered_set' declared here
'boost::unordered_set' declared herenote: | 'boost::unordered_set' declared hereC:
365
'boost::unordered_set' declared here ~~~~~~~~~~~~~~~^~~~~~P |
79
e./ClientManager.h 79
| e:s79 | r365t | 79 *:d | >2: u ::u sm uusi_siunsninsgeoerror: ngitrgn Ad gb boueno template named 'unordered_set' in namespace 'std'; did you mean 'boost::unordered_set'?bo otroobsosothe
sto:Pd t:s:::tue_365:u:nun:es | onourrorne drdo;tseder <trerdeCdreed/P:edr:/e:d:e: eu::du@rnIn file included from :u:nf*oItemIDRangeManager.cppun:onoi>r:urorx dndrdoederrerdmmeIn file included from 5ereee_rClientManagerHorseName.cppdedr3s:
_d_es_sdese_tee3ets;t;e;t
;
:d3t | |
| ^ ^| _ A2./ClientManager.h
^
^
spu:
:ett365trh./ClientManager.h:< P:2Cte365:Poe: e r2el;:ir s*error: t>/ /oerror: m f_@no template named 'unordered_set' in namespace 'std'; did you mean 'boost::unordered_set'? sfpeti
no template named 'unordered_set' in namespace 'std'; did you mean 'boost::unordered_set'?trx Am365
ue | | t3 365h3s | ^~~~~~~~~~~~~~~~~~2
P3t e ds error ep:t| srt:d generated boost::unordered_set;ru:
.
n:tougmake: *** [Makefile:110: .obj/MoneyLog.o] Error 1
/orn2/usr/local/include/boost/unordered/unordered_set_fwd.hpp/ do:l er error79i@rd:ssfee27ti: generateddr oxf_em.
sdenote: pegmake: *** [Makefile:110: .obj/PrivManager.o] Error 1
_3tt3'boost::unordered_set' declared heresr<3e
Ctp P<t79| eCr | eP ^~~~~~~~~~~~~~~~~~t
reo*e u ls| i>ris *n boost::unordered_settg
m>o_ f b/usr/local/include/boost/unordered/unordered_set_fwd.hpp so:pmo79tes:r_t27ts::
Ae: uu| 2ttnonote: ^~~~~~~~~~~~~~~~~~Ahr
d'boost::unordered_set' declared heree erroruP rtes
| e hed79 boost::unordered_set: |
: generatedPru e;.
n/usr/local/include/boost/unordered/unordered_set_fwd.hppou:rse 79di:en27gmake: *** [Makefile:110: .obj/ItemAwardManager.o] Error 1
rrg:;/e d _ /bsonote: eots'boost::unordered_set' declared here;t:
: u79| n | o ^r /@
deur/fsei idn@x:gfm:ieu x3nbm3oo2roe3dsetr3 :e error:du_ns3poesrtd;er3t
e generated dr| :: ^u
norp .
dttegmake: *** [Makefile:110: .obj/GuildManager.o] Error 1
ror edtl_soiet s;lti
s ot| f ^
opft rpt
r |
2| 2 ^~~~~~~~~~~~~~~~~~
^~~~~~~~~~~~~~~~~~
| | boost::unordered_set error error
boost::unordered_set
/usr/local/include/boost/unordered/unordered_set_fwd.hpp:ss/usr/local/include/boost/unordered/unordered_set_fwd.hpp79:: generated generated7927::27 : note: note: 'boost::unordered_set' declared here.
.
'boost::unordered_set' declared here
79 | 79 | usuisgmake: *** [Makefile:110: .obj/Marriage.o] Error 1
nigmake: *** [Makefile:110: .obj/ClientManagerEventFlag.o] Error 1
ngg boost::unordered::unordered_s ebto;
| ^
os2t error:s: generatedu.
ngmake: *** [Makefile:110: .obj/Monarch.o] Error 1
ordered::unor2d errorered_set;s
| ^
generated.
gmake: *** [Makefile:110: .obj/ClientManagerHorseName.o] Error 1
2 errors generated.
gmake: *** [Makefile:110: .obj/ItemIDRangeManager.o] Error 1